merhaba arkadaşlar ,yaptığım flutter projesini firebaseye bağladım fakat başlatırken sürekli bu hatayı alıyorum bunun nedenini bilen yazabilir mi?
FAILURE: Build failed with an exception.
Where:
Build file ‘C:\Users\edanu\AndroidStudioProjects\projeovevvi\android\app\build.gradle’ line: 27What went wrong:
A problem occurred evaluating project ‘:app’.
Could not read script ‘C:\Users\edanu\AndroidStudioProjects\projeovevvi\android\app\com.google.gms.google-services’ as it does not exist.
- Try:
Run with –stacktrace option to get the stack trace.
Run with –info or –debug option to get more log output.
Run with –scan to get full insights.
- Get more help at https://help.gradle.org
BU�LD FAILED in 1m 2s
Exception: Gradle task assembleDebug failed with exit code 1